Target
5-hydroxytryptamine receptor 1A
Ligand
BDBM50003342
Substrate
Meas. Tech.
ChEBML_1240
IC50
28±n/a nM
Citation
 Wikström, HAndersson, BElebring, TLagerkvist, SHallnemo, GPettersson, IJovall, PASvensson, KEkman, ACarlsson, A 6-Hydroxy-3-n-propyl-2,3,4,5-tetrahydro-1H-3-benzazepine and analogs: new centrally acting 5-HT1A receptor agonists. J Med Chem 35:3984-90 (1992)  
Target
Name:
5-hydroxytryptamine receptor 1A
Synonyms:
5-HT-1A 5-HT1A 5-hydroxytryptamine receptor 1A (5HT1A) 5ht1a Htr1a Serotonin 1a (5-HT1a) receptor/Adrenergic receptor alpha-1 | Serotonin receptor 1A
Type:
G Protein-Coupled Receptor (GPCR)
Mol. Mass.:
46445.29
Organism:
Rattus norvegicus (rat)
Description:
Binding assays were performed using rat hippocampal membranes.
Residue:
422
  
Inhibitor
Name:
BDBM50003342
Synonyms:
6-Bromo-9-methoxy-3-propyl-2,3,4,5-tetrahydro-1H-benzo[d]azepine | CHEMBL440340
Type:
Small organic molecule
Emp. Form.:
C14H20BrNO
Mol. Mass.:
298.219
SMILES:
CCCN1CCc2c(Br)ccc(OC)c2CC1
: