Target
Muscarinic acetylcholine receptor M1
Ligand
BDBM50003370
Substrate
Meas. Tech.
ChEMBL_138799 (CHEMBL751535)
IC50
840±n/a nM
Citation
 Ward, JSMerritt, LKlimkowski, VJLamb, MLMitch, CHBymaster, FPSawyer, BShannon, HEOlesen, PHHonoré, T Novel functional M1 selective muscarinic agonists. 2. Synthesis and structure-activity relationships of 3-pyrazinyl-1,2,5,6-tetrahydro-1-methylpyridines. Construction of a molecular model for the M1 pharmacophore. J Med Chem 35:4011-9 (1992)  
Target
Name:
Muscarinic acetylcholine receptor M1
Synonyms:
ACM1_RAT Chrm-1 cholinergic receptor, muscarinic 1
Type:
Enzyme Catalytic Domain
Mol. Mass.:
51390.46
Organism:
RAT
Description:
P08482
Residue:
460
  
Inhibitor
Name:
BDBM50003370
Synonyms:
2-Methoxy-3-(1-methyl-1,2,5,6-tetrahydro-pyridin-3-yl)-pyrazine | CHEMBL132331
Type:
Small organic molecule
Emp. Form.:
C11H15N3O
Mol. Mass.:
205.2563
SMILES:
COc1nccnc1C1=CCCN(C)C1
: