Target
Muscarinic acetylcholine receptor M1
Ligand
BDBM50003371
Substrate
Meas. Tech.
ChEMBL_138798 (CHEMBL751534)
IC50
84±n/a nM
Citation
 Ward, JSMerritt, LKlimkowski, VJLamb, MLMitch, CHBymaster, FPSawyer, BShannon, HEOlesen, PHHonoré, T Novel functional M1 selective muscarinic agonists. 2. Synthesis and structure-activity relationships of 3-pyrazinyl-1,2,5,6-tetrahydro-1-methylpyridines. Construction of a molecular model for the M1 pharmacophore. J Med Chem 35:4011-9 (1992)  
Target
Name:
Muscarinic acetylcholine receptor M1
Synonyms:
ACM1_RAT Chrm-1 cholinergic receptor, muscarinic 1
Type:
Enzyme Catalytic Domain
Mol. Mass.:
51390.46
Organism:
RAT
Description:
P08482
Residue:
460
  
Inhibitor
Name:
BDBM50003371
Synonyms:
5-(4-Hexyloxy-furazan-3-yl)-1-methyl-1,2,3,6-tetrahydro-pyridine | CHEMBL74786
Type:
Small organic molecule
Emp. Form.:
C14H23N3O2
Mol. Mass.:
265.3513
SMILES:
CCCCCCOc1nonc1C1=CCCN(C)C1
: