Target
Type-1 angiotensin II receptor
Ligand
BDBM50003378
Substrate
Meas. Tech.
ChEBML_36783
IC50
180±n/a nM
Citation
 Bradbury, RHAllott, CPDennis, MFisher, EMajor, JSMasek, BBOldham, AAPearce, RJRankine, NRevill, JM New nonpeptide angiotensin II receptor antagonists. 2. Synthesis, biological properties, and structure-activity relationships of 2-alkyl-4-(biphenylylmethoxy)quinoline derivatives. J Med Chem 35:4027-38 (1992)  
Target
Name:
Type-1 angiotensin II receptor
Synonyms:
AGTR1 AT1 | Angiotensin II type-1 receptor
Type:
PROTEIN
Mol. Mass.:
41004.19
Organism:
Cavia porcellus
Description:
ChEMBL_36783
Residue:
359
  
Inhibitor
Name:
BDBM50003378
Synonyms:
4'-(2-Methyl-quinolin-4-yloxymethyl)-biphenyl-2-carboxylic acid | CHEMBL132269
Type:
Small organic molecule
Emp. Form.:
C24H19NO3
Mol. Mass.:
369.4126
SMILES:
Cc1cc(OCc2ccc(cc2)-c2ccccc2C(O)=O)c2ccccc2n1
: