Target
Polyunsaturated fatty acid 5-lipoxygenase
Ligand
BDBM50003458
Substrate
Meas. Tech.
ChEBML_3958
IC50
250±n/a nM
Citation
 Wright, SWHarris, RRKerr, JSGreen, AMPinto, DJBruin, EMCollins, RJDorow, RLMantegna, LRSherk, SR Synthesis, chemical, and biological properties of vinylogous hydroxamic acids: dual inhibitors of 5-lipoxygenase and IL-1 biosynthesis. J Med Chem 35:4061-8 (1992)  
Target
Name:
Polyunsaturated fatty acid 5-lipoxygenase
Synonyms:
Alox5 LOX5_RAT
Type:
PROTEIN
Mol. Mass.:
78082.31
Organism:
Rattus norvegicus
Description:
ChEMBL_1432947
Residue:
673
  
Inhibitor
Name:
BDBM50003458
Synonyms:
(Z)-3-(Benzyl-hydroxy-amino)-1-(4-fluoro-phenyl)-but-2-en-1-one CHEMBL11871
Type:
Small organic molecule
Emp. Form.:
C17H16FNO2
Mol. Mass.:
285.3128
SMILES:
CC(=CC(=O)c1ccc(F)cc1)N(O)Cc1ccccc1
: