Target
Polyunsaturated fatty acid 5-lipoxygenase
Ligand
BDBM50003456
Substrate
Meas. Tech.
ChEBML_3958
IC50
>25000±n/a nM
Citation
 Wright, SWHarris, RRKerr, JSGreen, AMPinto, DJBruin, EMCollins, RJDorow, RLMantegna, LRSherk, SR Synthesis, chemical, and biological properties of vinylogous hydroxamic acids: dual inhibitors of 5-lipoxygenase and IL-1 biosynthesis. J Med Chem 35:4061-8 (1992)  
Target
Name:
Polyunsaturated fatty acid 5-lipoxygenase
Synonyms:
Alox5 LOX5_RAT
Type:
PROTEIN
Mol. Mass.:
78082.31
Organism:
Rattus norvegicus
Description:
ChEMBL_1432947
Residue:
673
  
Inhibitor
Name:
BDBM50003456
Synonyms:
3-(Hydroxy-methyl-amino)-1,2-diphenyl-propenone | CHEMBL131429
Type:
Small organic molecule
Emp. Form.:
C16H15NO2
Mol. Mass.:
253.2958
SMILES:
CN(O)\C=C(/C(=O)c1ccccc1)c1ccccc1
: