Target
Polyunsaturated fatty acid 5-lipoxygenase
Ligand
BDBM50003459
Substrate
Meas. Tech.
ChEBML_3958
IC50
3100±n/a nM
Citation
 Wright, SWHarris, RRKerr, JSGreen, AMPinto, DJBruin, EMCollins, RJDorow, RLMantegna, LRSherk, SR Synthesis, chemical, and biological properties of vinylogous hydroxamic acids: dual inhibitors of 5-lipoxygenase and IL-1 biosynthesis. J Med Chem 35:4061-8 (1992)  
Target
Name:
Polyunsaturated fatty acid 5-lipoxygenase
Synonyms:
Alox5 LOX5_RAT
Type:
PROTEIN
Mol. Mass.:
78082.31
Organism:
Rattus norvegicus
Description:
ChEMBL_1432947
Residue:
673
  
Inhibitor
Name:
BDBM50003459
Synonyms:
3-(Biphenyl-4-ylmethyl-hydroxy-amino)-1-furan-2-yl-propenone | CHEMBL130157
Type:
Small organic molecule
Emp. Form.:
C20H17NO3
Mol. Mass.:
319.3539
SMILES:
ON(Cc1ccc(cc1)-c1ccccc1)\C=C/C(=O)c1ccco1
: