Target
Amine oxidase [flavin-containing] B
Ligand
BDBM50003592
Substrate
Meas. Tech.
ChEMBL_123610 (CHEMBL734190)
Ki
820000±n/a nM
Citation
 Kalgutkar, ASCastagnoli, N Synthesis of novel MPTP analogs as potential monoamine oxidase B (MAO-B) inhibitors. J Med Chem 35:4165-74 (1992)  
Target
Name:
Amine oxidase [flavin-containing] B
Synonyms:
AOFB_BOVIN MAO-B Monoamine Oxidase Type B (MAO-B) Monoamine oxidase B | Monoamine oxidase type B
Type:
PROTEIN
Mol. Mass.:
58428.94
Organism:
Bos taurus
Description:
ChEMBL_1501478
Residue:
520
  
Inhibitor
Name:
BDBM50003592
Synonyms:
1-Methyl-4-phenylethynyl-1,2,3,6-tetrahydro-pyridine | CHEMBL123359
Type:
Small organic molecule
Emp. Form.:
C14H15N
Mol. Mass.:
197.2756
SMILES:
CN1CCC(=CC1)C#Cc1ccccc1
: