Target
Cholecystokinin receptor type A
Ligand
BDBM50003664
Substrate
Meas. Tech.
ChEMBL_50055 (CHEMBL662424)
IC50
2.4±n/a nM
Citation
 Tilley, JWDanho, WMadison, VFry, DSwistok, JMakofske, RMichalewsky, JSchwartz, AWeatherford, STriscari, J Analogs of CCK incorporating conformationally constrained replacements for Asp32. J Med Chem 35:4249-52 (1992)  
Target
Name:
Cholecystokinin receptor type A
Synonyms:
CCKAR_RAT Cholecystokinin peripheral Cholecystokinin receptor type A
Type:
Enzyme Catalytic Domain
Mol. Mass.:
49676.37
Organism:
RAT
Description:
Cholecystokinin central 0 RAT::P30551
Residue:
444
  
Inhibitor
Name:
BDBM50003664
Synonyms:
4-{2-Acetylamino-2-[1-({[1-{1-[1-(1-carbamoyl-2-phenyl-ethylcarbamoyl)-1-methyl-ethylcarbamoyl]-3-methylsulfanyl-propylcarbamoyl}-2-(1H-indol-3-yl)-ethylcarbamoyl]-methyl}-carbamoyl)-3-methylsulfanyl-propylcarbamoyl]-ethyl}-benzenesulfonic acid | CHEMBL263155
Type:
Small organic molecule
Emp. Form.:
C47H61N9O11S3
Mol. Mass.:
1024.236
SMILES:
CSCC[C@H](NC(=O)[C@H](Cc1ccc(cc1)S(O)(=O)=O)NC(C)=O)C(=O)NCC(=O)N[C@@H](Cc1c[nH]c2ccccc12)C(=O)N[C@@H](CCSC)C(=O)NC(C)(C)C(=O)N[C@@H](Cc1ccccc1)C(N)=O
: