Target
Cholecystokinin receptor type A
Ligand
BDBM50003670
Substrate
Meas. Tech.
ChEMBL_50055 (CHEMBL662424)
IC50
0.600000±n/a nM
Citation
 Tilley, JWDanho, WMadison, VFry, DSwistok, JMakofske, RMichalewsky, JSchwartz, AWeatherford, STriscari, J Analogs of CCK incorporating conformationally constrained replacements for Asp32. J Med Chem 35:4249-52 (1992)  
Target
Name:
Cholecystokinin receptor type A
Synonyms:
CCKAR_RAT Cholecystokinin peripheral Cholecystokinin receptor type A
Type:
Enzyme Catalytic Domain
Mol. Mass.:
49676.37
Organism:
RAT
Description:
Cholecystokinin central 0 RAT::P30551
Residue:
444
  
Inhibitor
Name:
BDBM50003670
Synonyms:
3-{2-[2-(2-{2-[2-Acetylamino-3-(4-sulfo-phenyl)-propionylamino]-4-methylsulfanyl-butyrylamino}-acetylamino)-3-(1H-indol-3-yl)-propionylamino]-4-methylsulfanyl-butyrylamino}-N-(1-carbamoyl-2-phenyl-ethyl)-succinamic acid | CHEMBL438773
Type:
Small organic molecule
Emp. Form.:
C47H59N9O13S3
Mol. Mass.:
1054.219
SMILES:
CSCC[C@H](NC(=O)[C@H](Cc1ccc(cc1)S(O)(=O)=O)NC(C)=O)C(=O)NCC(=O)N[C@@H](Cc1c[nH]c2ccccc12)C(=O)N[C@@H](CCSC)C(=O)N[C@@H](CC(O)=O)C(=O)N[C@@H](Cc1ccccc1)C(N)=O
: