Target
Non-receptor tyrosine-protein kinase TYK2/Tyrosine-protein kinase JAK2
Ligand
BDBM159748
Substrate
Meas. Tech.
ChEMBL_1672985 (CHEMBL4023014)
IC50
>16452±n/a nM
Citation
 Vazquez, MLKaila, NStrohbach, JWTrzupek, JDBrown, MFFlanagan, MEMitton-Fry, MJJohnson, TATenBrink, REArnold, EPBasak, AHeasley, SEKwon, SLangille, JParikh, MDGriffin, SHCasavant, JMDuclos, BAFenwick, AEHarris, TMHan, SCaspers, NDowty, MEYang, XBanker, MEHegen, MSymanowicz, PTLi, LWang, LLin, THJussif, JClark, JDTelliez, JBRobinson, RPUnwalla, R Identification of N-{cis-3-[Methyl(7H-pyrrolo[2,3-d]pyrimidin-4-yl)amino]cyclobutyl}propane-1-sulfonamide (PF-04965842): A Selective JAK1 Clinical Candidate for the Treatment of Autoimmune Diseases. J Med Chem 61:1130-1152 (2018)  
Target
Name:
Non-receptor tyrosine-protein kinase TYK2/Tyrosine-protein kinase JAK2
Synonyms:
JAK2/TYK2
Type:
Mol. Mass.:
Description:
ASSAY_ID of ChEMBL is 1368160
Components:
This complex has 2 components.
Component 1
Name:
Tyrosine-protein kinase JAK2
Synonyms:
JAK-2 JAK2_HUMAN Janus kinase 2 (JAK2) | Janus kinase 2 (a protein tyrosine kinase)
Type:
Protein
Mol. Mass.:
130684.68
Organism:
Homo sapiens (Human)
Description:
O60674
Residue:
1132
  
Component 2
Name:
Non-receptor tyrosine-protein kinase TYK2
Synonyms:
Non-receptor tyrosine-protein kinase TYK2 (TYK2) TYK2_HUMAN | Tyrosine-protein kinase TYK2
Type:
Protein
Mol. Mass.:
133666.03
Organism:
Homo sapiens (Human)
Description:
P29597
Residue:
1187
  
Inhibitor
Name:
BDBM159748
Synonyms:
US10966980, Example 2 | US9035074, 2
Type:
Small organic molecule
Emp. Form.:
C14H21N5O2S
Mol. Mass.:
323.414
SMILES:
CCCS(=O)(=O)N[C@H]1C[C@H](C1)N(C)c1ncnc2[nH]ccc12
: