Target
Amine oxidase [flavin-containing] A
Ligand
BDBM159748
Substrate
Meas. Tech.
ChEMBL_1672959 (CHEMBL4022988)
IC50
6000±n/a nM
Citation
 Vazquez, MLKaila, NStrohbach, JWTrzupek, JDBrown, MFFlanagan, MEMitton-Fry, MJJohnson, TATenBrink, REArnold, EPBasak, AHeasley, SEKwon, SLangille, JParikh, MDGriffin, SHCasavant, JMDuclos, BAFenwick, AEHarris, TMHan, SCaspers, NDowty, MEYang, XBanker, MEHegen, MSymanowicz, PTLi, LWang, LLin, THJussif, JClark, JDTelliez, JBRobinson, RPUnwalla, R Identification of N-{cis-3-[Methyl(7H-pyrrolo[2,3-d]pyrimidin-4-yl)amino]cyclobutyl}propane-1-sulfonamide (PF-04965842): A Selective JAK1 Clinical Candidate for the Treatment of Autoimmune Diseases. J Med Chem 61:1130-1152 (2018)  
Target
Name:
Amine oxidase [flavin-containing] A
Synonyms:
AOFA_HUMAN MAO-A Monoamine oxidase Monoamine oxidase type A (MAO A) Monoamine oxidase type A (MAOA)
Type:
Protein
Mol. Mass.:
59689.53
Organism:
Homo sapiens (Human)
Description:
P21397
Residue:
527
  
Inhibitor
Name:
BDBM159748
Synonyms:
US10966980, Example 2 | US9035074, 2
Type:
Small organic molecule
Emp. Form.:
C14H21N5O2S
Mol. Mass.:
323.414
SMILES:
CCCS(=O)(=O)N[C@H]1C[C@H](C1)N(C)c1ncnc2[nH]ccc12
: