Target
Urokinase-type plasminogen activator
Ligand
BDBM50003737
Substrate
Meas. Tech.
ChEMBL_213304 (CHEMBL814359)
Ki
18730±n/a nM
Citation
 Rai, RKatzenellenbogen, JA Effect of conformational mobility and hydrogen-bonding interactions on the selectivity of some guanidinoaryl-substituted mechanism-based inhibitors of trypsin-like serine proteases. J Med Chem 35:4297-305 (1992)  
Target
Name:
Urokinase-type plasminogen activator
Synonyms:
PLAU UROK_HUMAN Urokinase-type plasminogen activator (uPA) | Urokinase-type plasminogen activator/surface receptor
Type:
Enzyme
Mol. Mass.:
48528.62
Organism:
Homo sapiens (Human)
Description:
P00749
Residue:
431
  
Inhibitor
Name:
BDBM50003737
Synonyms:
(Lactone4)N-[4-(4-Guanidino-phenyl)-6-iodomethylene-2-oxo-tetrahydro-pyran-3-yl]-benzamide | CHEMBL135724
Type:
Small organic molecule
Emp. Form.:
C20H19IN4O3
Mol. Mass.:
490.2943
SMILES:
[#7]\[#6](-[#7])=[#7]\c1ccc(cc1)-[#6]-1-[#6]\[#6](-[#8]-[#6](=O)-[#6]-1-[#7]-[#6](=O)-c1ccccc1)=[#6]\I
: