Target
Thromboxane-A synthase
Ligand
BDBM50003759
Substrate
Meas. Tech.
ChEBML_209946
IC50
220±n/a nM
Citation
 Main, AJBhagwat, SSBoswell, CGoldstein, RGude, CCohen, DSFurness, PLee, WLouzan, M Thromboxane receptor antagonism combined with thromboxane synthase inhibition. 3. Pyridinylalkyl-substituted 8-[(arylsulfonyl)amino]octanoic acids. J Med Chem 35:4366-72 (1992)  
Target
Name:
Thromboxane-A synthase
Synonyms:
CYP5 Cytochrome P450 5A1 TBXAS1 TXA synthase TXS Thromboxane A2 Synthase (P450 TxA2) Thromboxane prostanoid Thromboxane-A synthase
Type:
Enzyme
Mol. Mass.:
60524.67
Organism:
Homo sapiens (Human)
Description:
P24557
Residue:
533
  
Inhibitor
Name:
BDBM50003759
Synonyms:
8-(4-Chloro-benzenesulfonylamino)-7-pyridin-3-yl-octanoic acid 8-(4-Chloro-benzenesulfonylamino)-7-pyridin-3-yl-octanoic acid; hydrochloride;hydrate CHEMBL544377
Type:
Small organic molecule
Emp. Form.:
C19H23ClN2O4S
Mol. Mass.:
410.915
SMILES:
OC(=O)CCCCCC(CNS(=O)(=O)c1ccc(Cl)cc1)c1cccnc1
: