Target
Thromboxane-A synthase
Ligand
BDBM50003803
Substrate
Meas. Tech.
ChEBML_209924
IC50
1.5±n/a nM
Citation
 Bhagwat, SSGude, CBoswell, CContardo, NCohen, DSDotson, RMathis, JLee, WFurness, PZoganas, H Thromboxane receptor antagonism combined with thromboxane synthase inhibition. 4. 8-[[(4-Chlorophenyl)sulfonyl]amino]-4-(3-(3-pyridinyl) propyl)octanoic acid and analogs. J Med Chem 35:4373-83 (1992)  
Target
Name:
Thromboxane-A synthase
Synonyms:
CYP5 Cytochrome P450 5A1 TBXAS1 TXA synthase TXS Thromboxane A2 Synthase (P450 TxA2) Thromboxane prostanoid Thromboxane-A synthase
Type:
Enzyme
Mol. Mass.:
60524.67
Organism:
Homo sapiens (Human)
Description:
P24557
Residue:
533
  
Inhibitor
Name:
BDBM50003803
Synonyms:
8-(Naphthalene-2-sulfonylamino)-4-(3-pyridin-3-yl-propyl)-octanoic acid | CHEMBL136738
Type:
Small organic molecule
Emp. Form.:
C26H32N2O4S
Mol. Mass.:
468.608
SMILES:
OC(=O)CCC(CCCCNS(=O)(=O)c1ccc2ccccc2c1)CCCc1cccnc1
: