Target
5-hydroxytryptamine receptor 1D
Ligand
BDBM50081704
Substrate
Meas. Tech.
ChEMBL_1658 (CHEMBL616649)
IC50
24±n/a nM
Citation
 Macor, JEBlake, JFox, CBJohnson, CKoe, BKLebel, LAMorrone, JMRyan, KSchmidt, AWSchulz, DW Synthesis and serotonergic pharmacology of the enantiomers of 3-[(N-methylpyrrolidin-2-yl)methyl]-5-methoxy-1H-indole: discovery of stereogenic differentiation in the aminoethyl side chain of the neurotransmitter serotonin. J Med Chem 35:4503-5 (1992)  
Target
Name:
5-hydroxytryptamine receptor 1D
Synonyms:
5-HT1D 5HT1D_CAVPO Serotonin 1d (5-HT1d) receptor
Type:
Enzyme Catalytic Domain
Mol. Mass.:
41780.38
Organism:
GUINEA PIG
Description:
5-HT1D HTR1D GUINEA PIG::Q60484
Residue:
376
  
Inhibitor
Name:
BDBM50081704
Synonyms:
5-Methoxy-3-((R)-1-methyl-pyrrolidin-2-ylmethyl)-1H-indole | CHEMBL137485
Type:
Small organic molecule
Emp. Form.:
C15H20N2O
Mol. Mass.:
244.3321
SMILES:
COc1ccc2[nH]cc(C[C@H]3CCCN3C)c2c1
: