Target
Acetylcholinesterase
Ligand
BDBM50004008
Substrate
Meas. Tech.
ChEBML_28911
IC50
800±n/a nM
Citation
 Sugimoto, HTsuchiya, YSugumi, HHigurashi, KKaribe, NIimura, YSasaki, AAraki, SYamanishi, YYamatsu, K Synthesis and structure-activity relationships of acetylcholinesterase inhibitors: 1-benzyl-4-(2-phthalimidoethyl)piperidine and related derivatives. J Med Chem 35:4542-8 (1993)  
Target
Name:
Acetylcholinesterase
Synonyms:
ACES_MOUSE Acetylcholinesterase (mouse AChE) Ache
Type:
Enzyme
Mol. Mass.:
68165.65
Organism:
Mus musculus (mouse)
Description:
Residue:
614
  
Inhibitor
Name:
BDBM50004008
Synonyms:
3-(2-(1-benzylpiperidin-4-yl)ethyl)-2,3-dihydroquinazolin-4(1H)-one CHEMBL141810
Type:
Small organic molecule
Emp. Form.:
C22H27N3O
Mol. Mass.:
349.4693
SMILES:
O=C1N(CCC2CCN(Cc3ccccc3)CC2)CNc2ccccc12
: