Target
Acetylcholinesterase
Ligand
BDBM50004016
Substrate
Meas. Tech.
ChEBML_28911
IC50
1.2±n/a nM
Citation
 Sugimoto, HTsuchiya, YSugumi, HHigurashi, KKaribe, NIimura, YSasaki, AAraki, SYamanishi, YYamatsu, K Synthesis and structure-activity relationships of acetylcholinesterase inhibitors: 1-benzyl-4-(2-phthalimidoethyl)piperidine and related derivatives. J Med Chem 35:4542-8 (1993)  
Target
Name:
Acetylcholinesterase
Synonyms:
ACES_MOUSE Acetylcholinesterase (mouse AChE) Ache
Type:
Enzyme
Mol. Mass.:
68165.65
Organism:
Mus musculus (mouse)
Description:
Residue:
614
  
Inhibitor
Name:
BDBM50004016
Synonyms:
CHEMBL138107 N-(2-(2-(1-benzylpiperidin-4-yl)ethyl)-1,3-dioxoisoindolin-5-yl)benzamide | N-{2-[2-(1-Benzyl-piperidin-4-yl)-ethyl]-1,3-dioxo-2,3-dihydro-1H-isoindol-5-yl}-benzamide
Type:
Small organic molecule
Emp. Form.:
C29H29N3O3
Mol. Mass.:
467.5589
SMILES:
O=C(Nc1ccc2C(=O)N(CCC3CCN(Cc4ccccc4)CC3)C(=O)c2c1)c1ccccc1
: