Target
Acetylcholinesterase
Ligand
BDBM50004019
Substrate
Meas. Tech.
ChEBML_28911
IC50
9400±n/a nM
Citation
 Sugimoto, HTsuchiya, YSugumi, HHigurashi, KKaribe, NIimura, YSasaki, AAraki, SYamanishi, YYamatsu, K Synthesis and structure-activity relationships of acetylcholinesterase inhibitors: 1-benzyl-4-(2-phthalimidoethyl)piperidine and related derivatives. J Med Chem 35:4542-8 (1993)  
Target
Name:
Acetylcholinesterase
Synonyms:
ACES_MOUSE Acetylcholinesterase (mouse AChE) Ache
Type:
Enzyme
Mol. Mass.:
68165.65
Organism:
Mus musculus (mouse)
Description:
Residue:
614
  
Inhibitor
Name:
BDBM50004019
Synonyms:
CHEMBL140769 N-(2-(1-benzylpiperidin-4-yl)ethyl)-N-phenylcyclohexanecarboxamide
Type:
Small organic molecule
Emp. Form.:
C27H36N2O
Mol. Mass.:
404.5875
SMILES:
O=C(C1CCCCC1)N(CCC1CCN(Cc2ccccc2)CC1)c1ccccc1
: