Target
Acetylcholinesterase
Ligand
BDBM50004024
Substrate
Meas. Tech.
ChEBML_28911
IC50
12000±n/a nM
Citation
 Sugimoto, HTsuchiya, YSugumi, HHigurashi, KKaribe, NIimura, YSasaki, AAraki, SYamanishi, YYamatsu, K Synthesis and structure-activity relationships of acetylcholinesterase inhibitors: 1-benzyl-4-(2-phthalimidoethyl)piperidine and related derivatives. J Med Chem 35:4542-8 (1993)  
Target
Name:
Acetylcholinesterase
Synonyms:
ACES_MOUSE Acetylcholinesterase (mouse AChE) Ache
Type:
Enzyme
Mol. Mass.:
68165.65
Organism:
Mus musculus (mouse)
Description:
Residue:
614
  
Inhibitor
Name:
BDBM50004024
Synonyms:
CHEMBL140936 [2-(1-Benzyl-piperidin-4-yl)-ethyl]-ethyl-phenyl-amine
Type:
Small organic molecule
Emp. Form.:
C22H30N2
Mol. Mass.:
322.487
SMILES:
CCN(CCC1CCN(Cc2ccccc2)CC1)c1ccccc1
: