Target
Acetylcholinesterase
Ligand
BDBM50004042
Substrate
Meas. Tech.
ChEBML_28911
IC50
440±n/a nM
Citation
 Sugimoto, HTsuchiya, YSugumi, HHigurashi, KKaribe, NIimura, YSasaki, AAraki, SYamanishi, YYamatsu, K Synthesis and structure-activity relationships of acetylcholinesterase inhibitors: 1-benzyl-4-(2-phthalimidoethyl)piperidine and related derivatives. J Med Chem 35:4542-8 (1993)  
Target
Name:
Acetylcholinesterase
Synonyms:
ACES_MOUSE Acetylcholinesterase (mouse AChE) Ache
Type:
Enzyme
Mol. Mass.:
68165.65
Organism:
Mus musculus (mouse)
Description:
Residue:
614
  
Inhibitor
Name:
BDBM50004042
Synonyms:
2-(2-(1-(4-methoxybenzyl)piperidin-4-yl)ethyl)-5-nitroisoindoline-1,3-dione CHEMBL336686
Type:
Small organic molecule
Emp. Form.:
C23H25N3O5
Mol. Mass.:
423.4617
SMILES:
COc1ccc(CN2CCC(CCN3C(=O)c4ccc(cc4C3=O)[N+]([O-])=O)CC2)cc1
: