Target
Adenosine receptor A2a/A2b
Ligand
BDBM50009509
Substrate
Meas. Tech.
ChEBML_27637
EC50
1.9±n/a nM
Citation
 Niiya, KOlsson, RAThompson, RDSilvia, SKUeeda, M 2-(N'-alkylidenehydrazino)adenosines: potent and selective coronary vasodilators. J Med Chem 35:4557-61 (1993)  
Target
Name:
Adenosine receptor A2a/A2b
Synonyms:
Adenosine A2 receptor
Type:
Mol. Mass.:
Description:
ASSAY_ID of ChEMBL is 329906
Components:
This complex has 2 components.
Component 1
Name:
Adenosine receptor A2b
Synonyms:
AA2BR_HUMAN ADORA2B Adenosine receptors A2b | Adenosine receptors; A2a & A2b
Type:
G Protein-Coupled Receptor (GPCR)
Mol. Mass.:
36341.22
Organism:
Homo sapiens (Human)
Description:
Residue:
332
  
Component 2
Name:
Adenosine receptor A2a
Synonyms:
A2A adenosine receptor (hA2A) ADENOSINE A2 ADORA2 Adenosine A2A receptor (A2AAR)
Type:
G Protein-Coupled Receptor (GPCR)
Mol. Mass.:
44716.46
Organism:
Homo sapiens (Human)
Description:
P29274
Residue:
412
  
Inhibitor
Name:
BDBM50009509
Synonyms:
(CGS 22,492) 2-[6-Amino-2-(2-cyclohexyl-ethylamino)-purin-9-yl]-5-hydroxymethyl-tetrahydro-furan-3,4-diol CHEMBL87459
Type:
Small organic molecule
Emp. Form.:
C18H28N6O4
Mol. Mass.:
392.4527
SMILES:
Nc1nc(NCCC2CCCCC2)nc2n(cnc12)C1O[C@H](CO)[C@@H](O)[C@H]1O
: