Target
Adenosine receptor A1
Ligand
BDBM50421971
Substrate
Meas. Tech.
ChEBML_29278
EC50
25704±n/a nM
Citation
 Niiya, KOlsson, RAThompson, RDSilvia, SKUeeda, M 2-(N'-alkylidenehydrazino)adenosines: potent and selective coronary vasodilators. J Med Chem 35:4557-61 (1993)  
Target
Name:
Adenosine receptor A1
Synonyms:
A1 adenosine receptor ADENOSINE A1 ADENOSINE A1 low Adenosine A1 receptor | Adenosine Receptor A1
Type:
Enzyme Catalytic Domain
Mol. Mass.:
36501.39
Organism:
GUINEA PIG
Description:
ADENOSINE A1 ADORA1 GUINEA PIG::P47745
Residue:
326
  
Inhibitor
Name:
BDBM50421971
Synonyms:
CHEMBL611917
Type:
Small organic molecule
Emp. Form.:
C20H27N7O4
Mol. Mass.:
429.4729
SMILES:
CC1(C)C2CC1C(CN=Nc1nc(N)c3ncn(C4O[C@H](CO)[C@@H](O)[C@H]4O)c3n1)=CC2
: