Target
Adenosine receptor A1
Ligand
BDBM50009509
Substrate
Meas. Tech.
ChEBML_29278
EC50
12303±n/a nM
Citation
 Niiya, KOlsson, RAThompson, RDSilvia, SKUeeda, M 2-(N'-alkylidenehydrazino)adenosines: potent and selective coronary vasodilators. J Med Chem 35:4557-61 (1993)  
Target
Name:
Adenosine receptor A1
Synonyms:
A1 adenosine receptor ADENOSINE A1 ADENOSINE A1 low Adenosine A1 receptor | Adenosine Receptor A1
Type:
Enzyme Catalytic Domain
Mol. Mass.:
36501.39
Organism:
GUINEA PIG
Description:
ADENOSINE A1 ADORA1 GUINEA PIG::P47745
Residue:
326
  
Inhibitor
Name:
BDBM50009509
Synonyms:
(CGS 22,492) 2-[6-Amino-2-(2-cyclohexyl-ethylamino)-purin-9-yl]-5-hydroxymethyl-tetrahydro-furan-3,4-diol CHEMBL87459
Type:
Small organic molecule
Emp. Form.:
C18H28N6O4
Mol. Mass.:
392.4527
SMILES:
Nc1nc(NCCC2CCCCC2)nc2n(cnc12)C1O[C@H](CO)[C@@H](O)[C@H]1O
: