Target
Sigma non-opioid intracellular receptor 1
Ligand
BDBM83449
Substrate
Meas. Tech.
ChEBML_201744
Ki
1090±n/a nM
Citation
 de Costa, BRMattson, MVGeorge, CLinders, JT Synthesis, configuration, and activity of isomeric 2-phenyl-2-(N-piperidinyl)bicyclo[3.1.0]hexanes at phencyclidine and sigma binding sites. J Med Chem 35:4704-12 (1993)  
Target
Name:
Sigma non-opioid intracellular receptor 1
Synonyms:
Aging-associated gene 8 protein SGMR1_HUMAN SIGMAR1 SR31747-binding protein Sigma 1-type opioid receptor Sigma1R | hSigmaR1
Type:
Enzyme Catalytic Domain
Mol. Mass.:
25124.85
Organism:
Homo sapiens (Human)
Description:
Q99720
Residue:
223
  
Inhibitor
Name:
BDBM83449
Synonyms:
1-(1-phenylcyclohexyl)piperidine;hydrochloride PCP PHENCYCLIDINE SMR001338811 | cid_9795678
Type:
Small organic molecule
Emp. Form.:
C17H25N
Mol. Mass.:
243.3871
SMILES:
C1CCN(CC1)C1(CCCCC1)c1ccccc1
: