Target
Renin
Ligand
BDBM50004405
Substrate
Meas. Tech.
ChEBML_195957
IC50
29±n/a nM
Citation
 Ashton, WTCantone, CLTolman, RLGreenlee, WJLynch, RJSchorn, TWStrouse, JFSiegl, PK Inhibitors of human renin with C-termini derived from amides and esters of alpha-mercaptoalkanoic acids. J Med Chem 35:2772-81 (1992)  
Target
Name:
Renin
Synonyms:
Angiotensinogenase RENI_HUMAN
Type:
Enzyme
Mol. Mass.:
45058.99
Organism:
Homo sapiens (Human)
Description:
Residue:
406
  
Inhibitor
Name:
BDBM50004405
Synonyms:
CHEMBL91839 | {1-[1-{1-Cyclohexylmethyl-2-hydroxy-3-[2-(4-methyl-piperazin-1-yl)-2-oxo-ethylsulfanyl]-propylcarbamoyl}-2-(1H-imidazol-4-yl)-ethylcarbamoyl]-2-phenyl-ethyl}-carbamic acid tert-butyl ester; hydrate
Type:
Small organic molecule
Emp. Form.:
C37H57N7O6S
Mol. Mass.:
727.957
SMILES:
CN1CCN(CC1)C(=O)CSC[C@H](O)[C@H](CC1CCCCC1)NC(=O)[C@H](Cc1cnc[nH]1)NC(=O)[C@H](Cc1ccccc1)NC(=O)OC(C)(C)C
: