Target
Cholecystokinin receptor type A/Gastrin/cholecystokinin type B receptor
Ligand
BDBM50004435
Substrate
Meas. Tech.
ChEMBL_40035 (CHEMBL653016)
EC50
26±n/a nM
Citation
 Ron, DGilon, CHanani, MVromen, ASelinger, ZChorev, M N-methylated analogs of Ac[Nle28,31]CCK(26-33): synthesis, activity, and receptor selectivity. J Med Chem 35:2806-11 (1992)  
Target
Name:
Cholecystokinin receptor type A/Gastrin/cholecystokinin type B receptor
Synonyms:
Cholecystokinin receptor
Type:
Mol. Mass.:
Description:
ASSAY_ID of ChEMBL is 357790
Components:
This complex has 2 components.
Component 1
Name:
Cholecystokinin receptor type A
Synonyms:
CCK-A receptor CCK1-R CCKAR_HUMAN Cholecystokinin receptor Cholecystokinin-1 Receptor
Type:
G Protein-Coupled Receptor (GPCR)
Mol. Mass.:
47859.34
Organism:
Homo sapiens (Human)
Description:
Stable expression of human CCK-1 receptors in HEK 293 cells.
Residue:
428
  
Component 2
Name:
Gastrin/cholecystokinin type B receptor
Synonyms:
CCK-2 receptor CCK-BR CCKRB Cholecystokinin receptor GASR_HUMAN | Gastrin/cholecystokinin type B receptor
Type:
G Protein-Coupled Receptor (GPCR)
Mol. Mass.:
48445.79
Organism:
Homo sapiens (Human)
Description:
Stable expression of human CCK-2 receptors in HEK 293 cells.
Residue:
447
  
Inhibitor
Name:
BDBM50004435
Synonyms:
3-Acetylamino-N-[1-{1-[({[1-{1-[1-(1-carbamoyl-2-phenyl-ethylcarbamoyl)-2-carboxy-ethylcarbamoyl]-pentylcarbamoyl}-2-(1H-indol-3-yl)-ethyl]-methyl-carbamoyl}-methyl)-carbamoyl]-pentylcarbamoyl}-2-(4-sulfooxy-phenyl)-ethyl]-succinamic acid | CHEMBL269185
Type:
Small organic molecule
Emp. Form.:
C54H70N10O17S
Mol. Mass.:
1163.255
SMILES:
CCCC[C@H](NC(=O)[C@H](Cc1ccc(OS(O)(=O)=O)cc1)NC(=O)[C@H](CC(O)=O)NC(C)=O)C(=O)NCC(=O)N(C)[C@@H](Cc1c[nH]c2ccccc12)C(=O)N[C@@H](CCCC)C(=O)N[C@@H](CC(O)=O)C(=O)N[C@@H](Cc1ccccc1)C(N)=O
: