Target
Cytochrome P450 7A1
Ligand
BDBM50004441
Substrate
Meas. Tech.
ChEBML_48771
IC50
1250±n/a nM
Citation
 Rotstein, DMKertesz, DJWalker, KASwinney, DC Stereoisomers of ketoconazole: preparation and biological activity. J Med Chem 35:2818-25 (1992)  
Target
Name:
Cytochrome P450 7A1
Synonyms:
CP7A1_RAT Cyp7a1
Type:
PROTEIN
Mol. Mass.:
56896.90
Organism:
Rattus norvegicus
Description:
ChEMBL_48771
Residue:
503
  
Inhibitor
Name:
BDBM50004441
Synonyms:
(2R,4R)-ketoconazole CHEMBL328863
Type:
Small organic molecule
Emp. Form.:
C26H28Cl2N4O4
Mol. Mass.:
531.431
SMILES:
CC(=O)N1CCN(CC1)c1ccc(OC[C@@H]2CO[C@@](Cn3ccnc3)(O2)c2ccc(Cl)cc2Cl)cc1
: