Target
Cytochrome P450 2C11
Ligand
BDBM50004442
Substrate
Meas. Tech.
ChEBML_78
IC50
34300±n/a nM
Citation
 Rotstein, DMKertesz, DJWalker, KASwinney, DC Stereoisomers of ketoconazole: preparation and biological activity. J Med Chem 35:2818-25 (1992)  
Target
Name:
Cytochrome P450 2C11
Synonyms:
CP2CB_RAT Cyp2c-11 | Cyp2c11
Type:
PROTEIN
Mol. Mass.:
57187.48
Organism:
Rattus norvegicus
Description:
ChEMBL_100121
Residue:
500
  
Inhibitor
Name:
BDBM50004442
Synonyms:
(2S,4S)-ketoconazole CHEMBL319160 | CIS-1-ACETYL-4-(4-((2-(2,4-DICHLOROPHENYL)-2-(1H-IMIDAZOL-1-YLMETHYL)-1,3-DIOXOLAN-4-YL)METHOXY)PHENYL)PIPERAZINE
Type:
Small organic molecule
Emp. Form.:
C26H28Cl2N4O4
Mol. Mass.:
531.431
SMILES:
CC(=O)N1CCN(CC1)c1ccc(OC[C@H]2CO[C@](Cn3ccnc3)(O2)c2ccc(Cl)cc2Cl)cc1
: