Target
Dihydrofolate reductase
Ligand
BDBM18044
Substrate
Meas. Tech.
ChEMBL_54416 (CHEMBL667174)
Kd
220±n/a nM
Citation
 Wagner, CRBenkovic, SJ Probing the molecular basis of resistance to pyrimethamine by site-directed mutagenesis. J Med Chem 35:2912-5 (1992)  
Target
Name:
Dihydrofolate reductase
Synonyms:
Dihydrofolate reductase (F31V) | dfrA17
Type:
Mol. Mass.:
17532.46
Organism:
Escherichia coli
Description:
Residue:
157
  
Inhibitor
Name:
BDBM18044
Synonyms:
(2S)-2-[(4-{[(2-amino-4-oxo-1,4,7,8-tetrahydropteridin-6-yl)methyl]amino}phenyl)formamido]pentanedioic acid dihydrofolic acid
Type:
Small organic molecule
Emp. Form.:
C19H21N7O6
Mol. Mass.:
443.4133
SMILES:
Nc1nc2NCC(CNc3ccc(cc3)C(=O)N[C@@H](CCC(O)=O)C(O)=O)=Nc2c(=O)[nH]1
: