Target
Dihydrofolate reductase
Ligand
BDBM18512
Substrate
Meas. Tech.
ChEMBL_54554 (CHEMBL664870)
Ki
5.2±n/a nM
Citation
 Wagner, CRBenkovic, SJ Probing the molecular basis of resistance to pyrimethamine by site-directed mutagenesis. J Med Chem 35:2912-5 (1992)  
Target
Name:
Dihydrofolate reductase
Synonyms:
Dihydrofolate reductase (F31V) | dfrA17
Type:
Mol. Mass.:
17532.46
Organism:
Escherichia coli
Description:
Residue:
157
  
Inhibitor
Name:
BDBM18512
Synonyms:
5-(4-chlorophenyl)-6-ethylpyrimidine-2,4-diamine Pyrimethamine (Pyr) cid_4993
Type:
Small organic molecule
Emp. Form.:
C12H13ClN4
Mol. Mass.:
248.711
SMILES:
CCc1nc(N)nc(N)c1-c1ccc(Cl)cc1
: