Target
Cholecystokinin receptor type A
Ligand
BDBM50004486
Substrate
Meas. Tech.
ChEBML_49579
IC50
81±n/a nM
Citation
 Holladay, MWBennett, MJTufano, MDLin, CWAsin, KEWitte, DGMiller, TRBianchi, BRNikkel, ALBednarz, L Synthesis and biological activity of CCK heptapeptide analogues. Effects of conformational constraints and standard modifications on receptor subtype selectivity, functional activity in vitro, and appetite suppression in vivo. J Med Chem 35:2919-28 (1992)  
Target
Name:
Cholecystokinin receptor type A
Synonyms:
CCK-A receptor CCK1-R CCKAR_CAVPO Cholecystokinin receptor type A | Cholecystokinin-1 receptor
Type:
Mol. Mass.:
48229.77
Organism:
Cavia porcellus
Description:
Residue:
430
  
Inhibitor
Name:
BDBM50004486
Synonyms:
CCK7 analogue | CHEMBL316709
Type:
Small organic molecule
Emp. Form.:
C47H58N8O13S
Mol. Mass.:
975.074
SMILES:
CCCC[C@H](NC(=O)CCc1ccc(OS(O)(=O)=O)cc1)C(=O)NCC(=O)N[C@@H](Cc1c[nH]c2ccccc12)C(=O)N1CCC[C@H]1C(=O)N[C@@H](CC(O)=O)C(=O)N(C)[C@@H](Cc1ccccc1)C(N)=O
: