Target
Cholecystokinin receptor type A/Gastrin/cholecystokinin type B receptor
Ligand
BDBM50004485
Substrate
Meas. Tech.
ChEMBL_70879 (CHEMBL684537)
EC50
140±n/a nM
Citation
 Holladay, MWBennett, MJTufano, MDLin, CWAsin, KEWitte, DGMiller, TRBianchi, BRNikkel, ALBednarz, L Synthesis and biological activity of CCK heptapeptide analogues. Effects of conformational constraints and standard modifications on receptor subtype selectivity, functional activity in vitro, and appetite suppression in vivo. J Med Chem 35:2919-28 (1992)  
Target
Name:
Cholecystokinin receptor type A/Gastrin/cholecystokinin type B receptor
Synonyms:
Cholecystokinin receptor
Type:
Mol. Mass.:
Description:
ASSAY_ID of ChEMBL is 357790
Components:
This complex has 2 components.
Component 1
Name:
Cholecystokinin receptor type A
Synonyms:
CCK-A receptor CCK1-R CCKAR_HUMAN Cholecystokinin receptor Cholecystokinin-1 Receptor
Type:
G Protein-Coupled Receptor (GPCR)
Mol. Mass.:
47859.34
Organism:
Homo sapiens (Human)
Description:
Stable expression of human CCK-1 receptors in HEK 293 cells.
Residue:
428
  
Component 2
Name:
Gastrin/cholecystokinin type B receptor
Synonyms:
CCK-2 receptor CCK-BR CCKRB Cholecystokinin receptor GASR_HUMAN | Gastrin/cholecystokinin type B receptor
Type:
G Protein-Coupled Receptor (GPCR)
Mol. Mass.:
48445.79
Organism:
Homo sapiens (Human)
Description:
Stable expression of human CCK-2 receptors in HEK 293 cells.
Residue:
447
  
Inhibitor
Name:
BDBM50004485
Synonyms:
CCK7 analogue | CHEMBL98631
Type:
Small organic molecule
Emp. Form.:
C44H55N7O12S
Mol. Mass.:
906.012
SMILES:
CC(C)C[C@H](NC(=O)[C@H](Cc1c[nH]c2ccccc12)NC(=O)CCCCNC(=O)CCc1ccc(OS(O)(=O)=O)cc1)C(=O)N[C@@H](CC(O)=O)C(=O)N[C@@H](Cc1ccccc1)C(N)=O
: