Target
Phospholipase A2, major isoenzyme
Ligand
BDBM50004500
Substrate
Meas. Tech.
ChEBML_156346
IC50
5000±n/a nM
Citation
 Bennion, CConnolly, SGensmantel, NPHallam, CJackson, CGPrimrose, WURoberts, GCRobinson, DHSlaich, PK Design and synthesis of some substrate analogue inhibitors of phospholipase A2 and investigations by NMR and molecular modeling into the binding interactions in the enzyme-inhibitor complex. J Med Chem 35:2939-51 (1992)  
Target
Name:
Phospholipase A2, major isoenzyme
Synonyms:
Group IB phospholipase A2 PLA2G1B Phospholipase A2
Type:
Hydrolase; monomer or homodimer
Mol. Mass.:
16279.83
Organism:
Sus scrofa (pig)
Description:
Purchased from Sigma.
Residue:
146
  
Inhibitor
Name:
BDBM50004500
Synonyms:
CHEMBL319067 | Phosphoric acid mono-(2-hexadecanoylamino-3-phenyl-propyl) ester
Type:
Small organic molecule
Emp. Form.:
C25H44NO5P
Mol. Mass.:
469.5943
SMILES:
CCCCCCCCCCCCCCCC(=O)N[C@@H](COP(O)(O)=O)Cc1ccccc1
: