Target
Acetyl-CoA carboxylase 1
Ligand
BDBM50247113
Substrate
Meas. Tech.
ChEMBL_1677380 (CHEMBL4027523)
IC50
5.8±n/a nM
Citation
 Mizojiri, RAsano, MTomita, DBanno, HNii, NSasaki, MSumi, HSatoh, YYamamoto, YMoriya, TSatomi, YMaezaki, H Discovery of Novel Selective Acetyl-CoA Carboxylase (ACC) 1 Inhibitors. J Med Chem 61:1098-1117 (2018)  
Target
Name:
Acetyl-CoA carboxylase 1
Synonyms:
ACAC ACACA_HUMAN ACC1 Acetyl-CoA carboxylase 1 | Acetyl-CoA carboxylase 1 (ACC1)
Type:
Protein
Mol. Mass.:
265543.22
Organism:
Homo sapiens (Human)
Description:
Q13085
Residue:
2346
  
Inhibitor
Name:
BDBM50247113
Synonyms:
CHEMBL4064621
Type:
Small organic molecule
Emp. Form.:
C23H25N3O5
Mol. Mass.:
423.4617
SMILES:
C[C@@H](COc1cnc(o1)-c1ccc(Oc2cccc(OCC3CC3)c2)cn1)NC(C)=O
: