Target
Acetyl-CoA carboxylase 1
Ligand
BDBM50247154
Substrate
Meas. Tech.
ChEMBL_1677380 (CHEMBL4027523)
IC50
140±n/a nM
Citation
 Mizojiri, RAsano, MTomita, DBanno, HNii, NSasaki, MSumi, HSatoh, YYamamoto, YMoriya, TSatomi, YMaezaki, H Discovery of Novel Selective Acetyl-CoA Carboxylase (ACC) 1 Inhibitors. J Med Chem 61:1098-1117 (2018)  
Target
Name:
Acetyl-CoA carboxylase 1
Synonyms:
ACAC ACACA_HUMAN ACC1 Acetyl-CoA carboxylase 1 | Acetyl-CoA carboxylase 1 (ACC1)
Type:
Protein
Mol. Mass.:
265543.22
Organism:
Homo sapiens (Human)
Description:
Q13085
Residue:
2346
  
Inhibitor
Name:
BDBM50247154
Synonyms:
CHEMBL4062997
Type:
Small organic molecule
Emp. Form.:
C27H29NO4
Mol. Mass.:
431.5235
SMILES:
CC(NC(C)=O)c1cccc(OCc2ccc(Oc3cccc(OCC4CC4)c3)cc2)c1
: