Target
Cholinesterase
Ligand
BDBM50004660
Substrate
Meas. Tech.
ChEBML_41586
IC50
6100±n/a nM
Citation
 Valli, MJTang, YKosh, JWChapman, JMSowell, JW Synthesis and cholinergic properties of N-aryl-2-[[[5-[(dimethylamino)methyl]-2-furanyl]methyl]thio]ethylamino analogs of ranitidine. J Med Chem 35:3141-7 (1992)  
Target
Name:
Cholinesterase
Synonyms:
Acylcholine acylhydrolase Butyrylcholine esterase (BChE) Butyrylcholinesterase (BuChE) CHLE_HUMAN Cholinesterases Pseudocholinesterase
Type:
Homotetramer
Mol. Mass.:
68422.27
Organism:
Homo sapiens (Human)
Description:
P06276
Residue:
602
  
Inhibitor
Name:
BDBM50004660
Synonyms:
CHEMBL107673 | N-[2-(5-Dimethylaminomethyl-furan-2-ylmethylsulfanyl)-ethyl]-4,6-dinitro-N'-pyridin-3-ylmethyl-benzene-1,3-diamine
Type:
Small organic molecule
Emp. Form.:
C22H26N6O5S
Mol. Mass.:
486.544
SMILES:
CN(C)Cc1ccc(CSCCNc2cc(NCc3cccnc3)c(cc2[N+]([O-])=O)[N+]([O-])=O)o1
: