Target
Acetylcholinesterase
Ligand
BDBM50004663
Substrate
Meas. Tech.
ChEBML_28294
IC50
680.0±n/a nM
Citation
 Valli, MJTang, YKosh, JWChapman, JMSowell, JW Synthesis and cholinergic properties of N-aryl-2-[[[5-[(dimethylamino)methyl]-2-furanyl]methyl]thio]ethylamino analogs of ranitidine. J Med Chem 35:3141-7 (1992)  
Target
Name:
Acetylcholinesterase
Synonyms:
ACES_HUMAN Acetylcholinesterase (AChE) | Acetylcholinesterase (human AChE)
Type:
Enzyme
Mol. Mass.:
67792.70
Organism:
Homo sapiens (Human)
Description:
P22303
Residue:
614
  
Inhibitor
Name:
BDBM50004663
Synonyms:
CHEMBL107254 | N-[2-(5-Dimethylaminomethyl-furan-2-ylmethylsulfanyl)-ethyl]-N'-(4-fluoro-phenyl)-4,6-dinitro-benzene-1,3-diamine
Type:
Small organic molecule
Emp. Form.:
C22H24FN5O5S
Mol. Mass.:
489.52
SMILES:
CN(C)Cc1ccc(CSCCNc2cc(Nc3ccc(F)cc3)c(cc2[N+]([O-])=O)[N+]([O-])=O)o1
: