Target
Acetylcholinesterase
Ligand
BDBM50004674
Substrate
Meas. Tech.
ChEBML_28294
IC50
370±n/a nM
Citation
 Valli, MJTang, YKosh, JWChapman, JMSowell, JW Synthesis and cholinergic properties of N-aryl-2-[[[5-[(dimethylamino)methyl]-2-furanyl]methyl]thio]ethylamino analogs of ranitidine. J Med Chem 35:3141-7 (1992)  
Target
Name:
Acetylcholinesterase
Synonyms:
ACES_HUMAN Acetylcholinesterase (AChE) | Acetylcholinesterase (human AChE)
Type:
Enzyme
Mol. Mass.:
67792.70
Organism:
Homo sapiens (Human)
Description:
P22303
Residue:
614
  
Inhibitor
Name:
BDBM50004674
Synonyms:
CHEMBL318517 | N-[2-(5-Dimethylaminomethyl-furan-2-ylmethylsulfanyl)-ethyl]-N'-(3-morpholin-4-yl-propyl)-4,6-dinitro-benzene-1,3-diamine
Type:
Small organic molecule
Emp. Form.:
C23H34N6O6S
Mol. Mass.:
522.618
SMILES:
CN(C)Cc1ccc(CSCCNc2cc(NCCCN3CCOCC3)c(cc2[N+]([O-])=O)[N+]([O-])=O)o1
: