Target
Muscarinic acetylcholine receptor M2
Ligand
BDBM50004667
Substrate
Meas. Tech.
ChEBML_140039
IC50
3100±n/a nM
Citation
 Valli, MJTang, YKosh, JWChapman, JMSowell, JW Synthesis and cholinergic properties of N-aryl-2-[[[5-[(dimethylamino)methyl]-2-furanyl]methyl]thio]ethylamino analogs of ranitidine. J Med Chem 35:3141-7 (1992)  
Target
Name:
Muscarinic acetylcholine receptor M2
Synonyms:
ACM2_RAT Chrm-2 | Chrm2
Type:
Enzyme Catalytic Domain
Mol. Mass.:
51555.53
Organism:
RAT
Description:
P10980
Residue:
466
  
Inhibitor
Name:
BDBM50004667
Synonyms:
CHEMBL320291 | N-[2-(5-Dimethylaminomethyl-furan-2-ylmethylsulfanyl)-ethyl]-N'-methyl-4,6-dinitro-benzene-1,3-diamine
Type:
Small organic molecule
Emp. Form.:
C17H23N5O5S
Mol. Mass.:
409.46
SMILES:
CNc1cc(NCCSCc2ccc(CN(C)C)o2)c(cc1[N+]([O-])=O)[N+]([O-])=O
: