Target
Polyunsaturated fatty acid 5-lipoxygenase
Ligand
BDBM50004676
Substrate
Meas. Tech.
ChEBML_4163
IC50
>25000±n/a nM
Citation
 Wright, SWHarris, RRCollins, RJCorbett, RLGreen, AMWadman, EABatt, DG Novel 1-(pyridylphenyl)-1-phenyl-2-imidazolylethanols with topical antiinflammatory activity. J Med Chem 35:3148-55 (1992)  
Target
Name:
Polyunsaturated fatty acid 5-lipoxygenase
Synonyms:
Alox5 LOX5_RAT
Type:
PROTEIN
Mol. Mass.:
78082.31
Organism:
Rattus norvegicus
Description:
ChEMBL_1432947
Residue:
673
  
Inhibitor
Name:
BDBM50004676
Synonyms:
1-(4-Fluoro-phenyl)-2-imidazol-1-yl-1-(4-pyridin-4-yl-phenyl)-ethanol | CHEMBL321024
Type:
Small organic molecule
Emp. Form.:
C22H18FN3O
Mol. Mass.:
359.3962
SMILES:
OC(Cn1ccnc1)(c1ccc(F)cc1)c1ccc(cc1)-c1ccncc1
: