Target
Phospholipase A2, major isoenzyme
Ligand
BDBM50004677
Substrate
Meas. Tech.
ChEBML_155878
IC50
>1000000±n/a nM
Citation
 Wright, SWHarris, RRCollins, RJCorbett, RLGreen, AMWadman, EABatt, DG Novel 1-(pyridylphenyl)-1-phenyl-2-imidazolylethanols with topical antiinflammatory activity. J Med Chem 35:3148-55 (1992)  
Target
Name:
Phospholipase A2, major isoenzyme
Synonyms:
Group IB phospholipase A2 PLA2G1B Phospholipase A2
Type:
Hydrolase; monomer or homodimer
Mol. Mass.:
16279.83
Organism:
Sus scrofa (pig)
Description:
Purchased from Sigma.
Residue:
146
  
Inhibitor
Name:
BDBM50004677
Synonyms:
Acetic acid 4-acetoxy-6-chloro-2,3-dimethoxy-naphthalen-1-yl ester Acetic acid 4-acetoxy-6-chloro-2,3-dimethoxy-naphthalen-1-yl ester (lonapalane) CHEMBL36648 RS-43179
Type:
Small organic molecule
Emp. Form.:
C16H15ClO6
Mol. Mass.:
338.74
SMILES:
COc1c(OC)c(OC(C)=O)c2cc(Cl)ccc2c1OC(C)=O
: