Target
Polyunsaturated fatty acid 5-lipoxygenase
Ligand
BDBM50004678
Substrate
Meas. Tech.
ChEBML_4163
IC50
>25000±n/a nM
Citation
 Wright, SWHarris, RRCollins, RJCorbett, RLGreen, AMWadman, EABatt, DG Novel 1-(pyridylphenyl)-1-phenyl-2-imidazolylethanols with topical antiinflammatory activity. J Med Chem 35:3148-55 (1992)  
Target
Name:
Polyunsaturated fatty acid 5-lipoxygenase
Synonyms:
Alox5 LOX5_RAT
Type:
PROTEIN
Mol. Mass.:
78082.31
Organism:
Rattus norvegicus
Description:
ChEMBL_1432947
Residue:
673
  
Inhibitor
Name:
BDBM50004678
Synonyms:
2-Imidazol-1-yl-1-(4-pyridin-4-yl-phenyl)-1-p-tolyl-ethanol | CHEMBL108795
Type:
Small organic molecule
Emp. Form.:
C23H21N3O
Mol. Mass.:
355.4323
SMILES:
Cc1ccc(cc1)C(O)(Cn1ccnc1)c1ccc(cc1)-c1ccncc1
: