Target
Adenosine receptor A1
Ligand
BDBM50004710
Substrate
Meas. Tech.
ChEBML_28536
Ki
33000±n/a nM
Citation
 Peet, NPLentz, NLSunder, SDudley, MWOgden, AM Conformationally restrained, chiral (phenylisopropyl)amino-substituted pyrazolo[3,4-d]pyrimidines and purines with selectivity for adenosine A1 and A2 receptors. J Med Chem 35:3263-9 (1992)  
Target
Name:
Adenosine receptor A1
Synonyms:
AA1R_RAT ADENOSINE A1 high Adenosine A1 receptor (A1) Adenosine receptors A1 | Adora1
Type:
Protein
Mol. Mass.:
36704.13
Organism:
Rattus norvegicus (rat)
Description:
Residue:
326
  
Inhibitor
Name:
BDBM50004710
Synonyms:
(2S,3S)-2-Methyl-3,7-diphenyl-5-propoxy-2,7-dihydro-3H-imidazo[1,2-c]pyrazolo[4,3-e]pyrimidine CHEMBL110749
Type:
Small organic molecule
Emp. Form.:
C23H23N5O
Mol. Mass.:
385.4616
SMILES:
CCCOC1=Nc2c(cnn2-c2ccccc2)C2=N[C@@H](C)[C@@H](N12)c1ccccc1
: