Target
Muscarinic acetylcholine receptor
Ligand
BDBM50004737
Substrate
Meas. Tech.
ChEMBL_138302 (CHEMBL744332)
EC50
500±n/a nM
Citation
 Nilsson, BMVargas, HMHacksell, U Urea and 2-imidazolidone derivatives of the muscarinic agents oxotremorine and N-methyl-N-(1-methyl-4-pyrrolidino-2-butynyl)acetamide. J Med Chem 35:3270-9 (1992)  
Target
Name:
Muscarinic acetylcholine receptor
Synonyms:
GPM3 | Muscarinic acetylcholine receptor M3
Type:
Mol. Mass.:
66272.13
Organism:
Cavia porcellus
Description:
Residue:
587
  
Inhibitor
Name:
BDBM50004737
Synonyms:
3-Methyl-1-(4-pyrrolidin-1-yl-but-2-ynyl)-pyrrolidin-2-one | CHEMBL109815
Type:
Small organic molecule
Emp. Form.:
C13H20N2O
Mol. Mass.:
220.3107
SMILES:
CC1CCN(CC#CCN2CCCC2)C1=O
: