Target
Prothrombin
Ligand
BDBM50004742
Substrate
Meas. Tech.
ChEBML_208343
Ki
3.2±n/a nM
Citation
 DiMaio, JGibbs, BLefebvre, JKonishi, YMunn, DYue, SYHornberger, W Synthesis of a homologous series of ketomethylene arginyl pseudodipeptides and application to low molecular weight hirudin-like thrombin inhibitors. J Med Chem 35:3331-41 (1992)  
Target
Name:
Prothrombin
Synonyms:
Activation peptide fragment 1 Coagulation factor II Prothrombin precursor Thrombin heavy chain | Thrombin light chain
Type:
Protein
Mol. Mass.:
70029.57
Organism:
Homo sapiens (Human)
Description:
P00734
Residue:
622
  
Inhibitor
Name:
BDBM50004742
Synonyms:
CHEMBL385670 | Hirudin analogue
Type:
Small organic molecule
Emp. Form.:
C82H118N16O20
Mol. Mass.:
1647.9095
SMILES:
CC[C@H](C)[C@H](NC(=O)[C@@H]1CCCN1C(=O)[C@H](CCC(O)=O)NC(=O)[C@H](Cc1ccccc1)NC(=O)[C@H](CC(O)=O)NC(=O)C\C=C\CNC(=O)C\C=C\CNC(=O)C\C=C\CNC(=O)CCCCC(=O)C(CCCNC(N)=N)NC(=O)[C@@H]1CCCN1C(=O)[C@H](Cc1ccccc1)NC(C)=O)C(=O)N1CCC[C@H]1C(=O)N[C@@H](CC(C)C)C(O)=O
: