Target
ATP-binding cassette sub-family C member 3
Ligand
BDBM10989
Substrate
Meas. Tech.
ChEMBL_1678646 (CHEMBL4028923)
IC50
>133000±n/a nM
Citation
 Morgan, REvan Staden, CJChen, YKalyanaraman, NKalanzi, JDunn, RTAfshari, CAHamadeh, HK A multifactorial approach to hepatobiliary transporter assessment enables improved therapeutic compound development. Toxicol Sci 136:216-41 (2013)  
Target
Name:
ATP-binding cassette sub-family C member 3
Synonyms:
ABCC3 CMOAT2 MLP2 MRP3 Multi-specific organic anion transporter D | Multidrug resistance-associated protein 3
Type:
PROTEIN
Mol. Mass.:
169352.45
Organism:
Homo sapiens (Human)
Description:
ChEMBL_735421
Residue:
1527
  
Inhibitor
Name:
BDBM10989
Synonyms:
(1R)-N-(prop-2-yn-1-yl)-2,3-dihydro-1H-inden-1-amine Rasagiline | US9034303, Rasagiline
Type:
Small organic molecule
Emp. Form.:
C12H13N
Mol. Mass.:
171.2383
SMILES:
C#CCN[C@@H]1CCc2ccccc12
: