Target
ATP-binding cassette sub-family C member 3
Ligand
BDBM50108879
Substrate
Meas. Tech.
ChEMBL_1678646 (CHEMBL4028923)
IC50
35100±n/a nM
Citation
 Morgan, REvan Staden, CJChen, YKalyanaraman, NKalanzi, JDunn, RTAfshari, CAHamadeh, HK A multifactorial approach to hepatobiliary transporter assessment enables improved therapeutic compound development. Toxicol Sci 136:216-41 (2013)  
Target
Name:
ATP-binding cassette sub-family C member 3
Synonyms:
ABCC3 CMOAT2 MLP2 MRP3 Multi-specific organic anion transporter D | Multidrug resistance-associated protein 3
Type:
PROTEIN
Mol. Mass.:
169352.45
Organism:
Homo sapiens (Human)
Description:
ChEMBL_735421
Residue:
1527
  
Inhibitor
Name:
BDBM50108879
Synonyms:
(2E)-2-cyano-3-(3,4-dihydroxy-5-nitrophenyl)-N,N-diethylprop-2-enamide CHEMBL953 ENTACAPONE | N,N-diethyl-2-cyano-3-(3,4-dihydroxy-5-nitrophenyl) acrylamide
Type:
Small organic molecule
Emp. Form.:
C14H15N3O5
Mol. Mass.:
305.286
SMILES:
CCN(CC)C(=O)C(=C\c1cc(O)c(O)c(c1)[N+]([O-])=O)\C#N
: