Target
ATP-binding cassette sub-family C member 3
Ligand
BDBM26197
Substrate
Meas. Tech.
ChEMBL_1678646 (CHEMBL4028923)
IC50
>133000±n/a nM
Citation
 Morgan, REvan Staden, CJChen, YKalyanaraman, NKalanzi, JDunn, RTAfshari, CAHamadeh, HK A multifactorial approach to hepatobiliary transporter assessment enables improved therapeutic compound development. Toxicol Sci 136:216-41 (2013)  
Target
Name:
ATP-binding cassette sub-family C member 3
Synonyms:
ABCC3 CMOAT2 MLP2 MRP3 Multi-specific organic anion transporter D | Multidrug resistance-associated protein 3
Type:
PROTEIN
Mol. Mass.:
169352.45
Organism:
Homo sapiens (Human)
Description:
ChEMBL_735421
Residue:
1527
  
Inhibitor
Name:
BDBM26197
Synonyms:
CHEMBL112 Norco US9333197, Acetaminophen phenol derivative, 11
Type:
Small organic molecule
Emp. Form.:
C8H9NO2
Mol. Mass.:
151.1626
SMILES:
CC(=O)Nc1ccc(O)cc1
: