Target
ATP-binding cassette sub-family C member 4
Ligand
BDBM50248354
Substrate
Meas. Tech.
ChEMBL_1678647 (CHEMBL4028924)
IC50
5100±n/a nM
Citation
 Morgan, REvan Staden, CJChen, YKalyanaraman, NKalanzi, JDunn, RTAfshari, CAHamadeh, HK A multifactorial approach to hepatobiliary transporter assessment enables improved therapeutic compound development. Toxicol Sci 136:216-41 (2013)  
Target
Name:
ATP-binding cassette sub-family C member 4
Synonyms:
ABCC4 MOAT-B MRP/cMOAT-related ABC transporter MRP4_HUMAN Multidrug resistance-associated protein 4
Type:
PROTEIN
Mol. Mass.:
149546.12
Organism:
Homo sapiens (Human)
Description:
ChEMBL_1486828
Residue:
1325
  
Inhibitor
Name:
BDBM50248354
Synonyms:
9-NC RFS-2000 | Rubitecan
Type:
Small organic molecule
Emp. Form.:
C20H15N3O6
Mol. Mass.:
393.3496
SMILES:
CC[C@@]1(O)C(=O)OCc2c1cc1-c3nc4cccc([N+]([O-])=O)c4cc3Cn1c2=O
: